Home > Make Error > Make Error C Compiler Cannot Create Executables

Make Error C Compiler Cannot Create Executables

build 5658) (LLVM build 2336.11.00) So I created a symlink: cd /usr/bin sudo ln -s gcc gcc-4.2 And it worked! (the config.log file is located in the directory that make is This site is not affiliated with Linus Torvalds or The Open Group in any way. share|improve this answer answered Jul 17 '15 at 23:42 Celada 20.6k13755 build-essential is the right way to go –abligh Jul 18 '15 at 8:16 3 @eyoung100 the question configure:2973: $? = 0 configure:2980: gcc -v >&5 Using built-in specs. navigate here

Not the answer you're looking for? no checking for RCC... By joining our community you will have the ability to post topics, receive our newsletter, use the advanced search, subscribe to threads and access many other special features. Comment 5 Jonathan Wakely 2012-01-26 10:41:20 UTC The problem you're facing is that you didn't read the documentation on installing GCC, starting at http://gcc.gnu.org/install/ and summarised at http://gcc.gnu.org/wiki/InstallingGCC We can't really http://unix.stackexchange.com/questions/146402/configure-error-c-compiler-cannot-create-executables

Can anyone tell me what should i do for next?? PATH: /usr/NX/bin PATH: /usr/lib64/mpi/gcc/openmpi/bin PATH: /home/username/bin PATH: /usr/local/bin PATH: /usr/bin PATH: /bin PATH: /usr/bin/X11 PATH: /usr/X11R6/bin PATH: /usr/games PATH: /opt/kde3/bin PATH: /usr/lib/mit/bin PATH: /usr/lib/mit/sbin PATH: /opt/gnome/bin PATH: /usr/lib/qt3/bin PATH: /home/fms/bin PATH: Call and run php script from shell script How exactly std::string_view is faster than const std::string&? Etymologically, why do "ser" and "estar" exist?

If that is the case this would be "tools unique to the programming profession" or what ever it is that the FAQ says. –dmckee Apr 28 '12 at 1:23 3 Join our community today! awk checking whether make sets $(MAKE)... share|improve this answer answered Nov 15 '13 at 4:56 konrad 1,2931221 2 This worked for me; Xcode was install (clean Mavericks installation) but the command-line tools weren't automatically installed. –JESii

I ./configure'd as root to install it. Browse other questions tagged linux-mint gcc wine or ask your own question. linux-mint gcc wine share|improve this question edited Jul 18 '15 at 4:51 eyoung100 3,9201137 asked Jul 17 '15 at 23:31 BrokenRobot 31113 1 What happens if you create a trivial This happended because I made the mistake to use TextEdit (I'm working under MacOS), and this is apparently a feature called SmartQuotes: the quote sign CHANGES BY ITSELF TO THE ILLEGAL

no checking for FCC... x86_64-unknown-linux-gnu checking host system type... Referee did not fully understand accepted paper What do aviation agencies do to make waypoints sequences more easy to remember to prevent navigation mistakes? Target: i686-apple-darwin9 Configured with: /var/tmp/gcc/gcc-5484~1/src/configure --disable-checking -enable-werror --prefix=/usr --mandir=/share/man --enable-languages=c,objc,c++,obj-c++ --program-transform-name=/^[cg][^.-]*$/s/$/-4.0/ --with-gxx-include-dir=/include/c++/4.0.0 --with-slibdir=/usr/lib --build=i686-apple-darwin9 --with-arch=apple --with-tune=generic --host=i686-apple-darwin9 --target=i686-apple-darwin9 Thread model: posix gcc version 4.0.1 (Apple Inc.

Oh a big note, the gcc install from the rvm command can take around 10-15 minutes without throwing out any text, it's not frozen :) Good luck share|improve this answer answered Get More Information In my case right now it was caused by wrong compiler parameter. Hexagonal minesweeper Etymologically, why do "ser" and "estar" exist? grantgeorge commented Aug 24, 2015 @yagudaev @hiteshsharma helped me, thanks ;) t0d0r commented Oct 27, 2015 Hi, I managed to compile ruby 1.8.7-p375 on El Capitan (10.11.1), here's how: brew install

In my .bash_profile file I had: export ARM_ARCH="arm64” export CFLAGS="-arch ${ARM_ARCH}" As you can observe --- export ARM_ARCH="arm64” --- the last quote sign is not the same with the first quote check over here After output "see config.log" I went to look at it; I missed the correct one, as there was one in project directory, which is not the correct one; correct one for i686-pc-linuxlibc1 checking for a BSD-compatible install... /usr/bin/install -c checking whether build environment is sane... I tried the: ./configure DFLAGS="-O3" command but with no effect.

ia64-redhat-linux-ranlib checking for ia64-redhat-linux-strip... mkdir -p -- ia64-redhat-linux/libgcc Configuring in ia64-redhat-linux/libgcc configure: creating cache ./config.cache checking for --enable-version-specific-runtime-libs... I have released MELT 1.2.0 for GCC 4.9 & 5.x a few days ago (end of july 2015). his comment is here You can find the recommended way for Ubuntu.

Modified: branches/gcc-4_7-branch/libquadmath/ChangeLog branches/gcc-4_7-branch/libquadmath/configure branches/gcc-4_7-branch/libquadmath/configure.ac Comment 13 Benjamin Kosnik 2012-05-31 18:59:38 UTC Author: bkoz Date: Thu May 31 18:59:34 2012 New Revision: 188078 URL: http://gcc.gnu.org/viewcvs?root=gcc&view=rev&rev=188078 Log: 2012-05-31 Benjamin Kosnik PR libstdc++/52007 Here's what I'm getting: j-court-demones-macbook-pro:libevent-1.4.12-stable jcourtdemone$ ./configure; make checking for a BSD-compatible install... /usr/bin/install -c checking whether build environment is sane... It was created by configure, which was generated by GNU Autoconf 2.64.

In addition, #-- specify a space-delimited list of hosts running in the DistCC cluster. #DISTCC_HOSTS="" ######################################################################### # GLOBAL PACKAGE OPTIONS # These are default values for the options=() settings ######################################################################### #

i686-pc-linux-gnu checking host system type... If you meant to cross compile, use '--host'0configure: error: C compiler cannot create executables: wxPython 3.0.2.01how to configure: error: C compiler cannot create executables0Installing 3rd party C library. The answer by steroscott fixed my issue a while back...this time around not the case. It was created by configure, which was generated by GNU Autoconf 2.63.

ia64-unknown-linux-gnu checking for a BSD compatible install... /usr/bin/install -c checking whether ln works... Do worry about these: /usr/bin/ld: cannot find crt1.o: No such file or directory /usr/bin/ld: cannot find crti.o: No such file or directory /usr/bin/ld: cannot find -lc /usr/bin/ld: cannot find crtn.o: No Both my gcc and base-devel were somehow corrupted, but after forcing a reinstall my builds are going along nicely. http://edvinfo.com/make-error/make-error-1-ignored.html Not the answer you're looking for?

How to create a company culture that cares about information security? gcc-4.2 checking for gcc... (cached) gcc-4.2 checking whether the C compiler works... share|improve this answer answered Sep 27 '14 at 17:29 C-Rock 1 add a comment| up vote 0 down vote Make sure there are no spaces in your Xcode application name (can Lesson learned: use a proper text editor...

But I have this error: BUILD FAILED Inspect or clean up the working tree at /var/folders/fn/1kz6tqdd2b58vl6lggn7ks4r0000gn/T/ruby-build.20130901135911.4559 Results logged to /var/folders/fn/1kz6tqdd2b58vl6lggn7ks4r0000gn/T/ruby-build.20130901135911.4559.log Last 10 log lines: checking build system type... Here is content of config.log > > #/usr/local/bin/autoconf -v > # ./configure Why have you done that? I use KDevelop for unix (c++ dev tool).